{"text_format":"1","workbook":"xlsx","n_sheets":6,"sheets":["Instructions","1) Corporate Data","2) Admin Access","3) Property Information","4) Check Scanning Enrollment","Copy of FinalHeader 1"],"not_rendered":{"charts":0,"images":2,"macros":0,"external_links":0,"defined_names":0,"comments":1,"pivot_tables":0},"unopened":[],"bounds":{"document_bytes":16777216,"sheet_cells":100000,"rows_first":2000,"rows_last":500,"rows_between":2000,"halvings":0,"cell_chars":16384,"cell_head_chars":4096},"cells_cut":0,"cells_raw":0,"read":"whole","date_system":"1900"}

{"sheet":"Instructions","index":0,"n_rows":4,"n_cols":1,"rows_kept":4,"cut":false,"hidden":false,"merged":[]}
["Instructions:"]
["Complete each tab on this worksheet to provide Aptexx with your customer information. "]
["ONLY complete tab 4 if you are using Aptexx check scanning services."]
["Email your Aptexx rep when complete. "]

{"sheet":"1) Corporate Data","index":1,"n_rows":32,"n_cols":1,"rows_kept":32,"cut":false,"hidden":false,"merged":[[27,0,27,7]]}
["DBA"]
["Legal Name (\"Merchant\")"]
["State of Incorporation"]
["In Business Since"]
["Physical Address (No PO Boxes)"]
["City"]
["State"]
["Zip"]
["Website Address"]
["Customer Support Phone"]
["Tax ID"]
["Corporate Contact Person"]
["Home Address"]
["City"]
["State"]
["Zip"]
["Phone"]
["Date of Birth"]
["DL#"]
["DL State"]
["Authorized Contact - Signatory Name"]
[]
[]
[]
[]
[]
[]
[]
[]
[]
[]
["Electronic Signature"]

{"sheet":"2) Admin Access","index":2,"n_rows":2,"n_cols":4,"rows_kept":2,"cut":false,"hidden":false,"merged":[[0,0,0,3]]}
["Super User - Please add only one user. We will train the 'Super User' how to add additional users"]
["First Name","Last Name ","Email Address","Phone"]

{"sheet":"3) Property Information","index":3,"n_rows":1,"n_cols":68,"rows_kept":1,"cut":false,"hidden":false,"merged":[]}
["*Property Name","*Legal Name","*First name","*Last Name","Integration ID","*Address","*City","*State","*Zip","*Phone","*Timezone","*Tax ID","*Average Rent","*Num Units","Key Bank Billing Account","Key Bank Billing Routing","Key Bank Start","Key Bank Billing Element","Rent Bank Account","Rent Bank Routing","Rent BankServ Client ID","Rent BankServ Client Code","Rent BankServ ICL Code","Rent ProPay ACH Tier","Rent ProPay Card Tier","Rent Balance Type","*Rent Amount Type","Rent Schedule Amount Type","Rent ACH","Rent Card","Rent ICL","Rent ACH Flat Fee","Rent Debit Flat Fee","Rent Credit Percentage Fee","Rent Max Amt","Application Bank Account","Application Bank Routing","Application BankServ Client ID","Application BankServ Client Code","Application BankServ ICL Code","Application ProPay Card Tier","Application ACH","Application Card","Application ACH Flat Fee","Application Debit Flat Fee","Application Credit Percentage Fee","Application Max Amt","Deposit Bank Account","Deposit Bank Routing","Deposit BankServ Client ID","Deposit BankServ Client Code","Deposit BankServ ICL Code","Deposit ProPay Card Tier","Deposit ACH","Deposit Card","Deposit ICL","Deposit ACH Flat Fee","Deposit Debit Flat Fee","Deposit Credit Percentage Fee","Deposit Max Amt","Result Limit","Engagement Days","Search Type","Messaging","Payments","Scanning","Maintenance","Surveys"]

{"sheet":"4) Check Scanning Enrollment","index":4,"n_rows":4,"n_cols":17,"rows_kept":4,"cut":false,"hidden":false,"merged":[]}
[]
["For properties to accept electronic payments, please complete the colored fields only. Fill out all 3 tabs below. "]
["Save in Excel format. Be sure no leading zeroes are omitted."]
["Property Name","Legal Name","Physical Address (we can not accept PO Boxes)","City","State","Zip","Phone","Bank Account Number","Routing Number","Security Deposit Bank Account Number","Security Deposit Routing Number","Bank Name","Tax ID","Average Rent","# Units","Max Tranaction","Monthly Volume"]

{"sheet":"Copy of FinalHeader 1","index":5,"n_rows":41,"n_cols":68,"rows_kept":41,"cut":false,"hidden":true,"merged":[]}
["*Property Name","*Legal Name","*First name","*Last Name","Integration ID","*Address","*City","*State","*Zip","*Phone","*Timezone","*Tax ID","*Average Rent","*Num Units","Key Bank Billing Account","Key Bank Billing Routing","Key Bank Start","Key Bank Billing Element","Rent Bank Account","Rent Bank Routing","Rent BankServ Client ID","Rent BankServ Client Code","Rent BankServ ICL Code","Rent ProPay ACH Tier","Rent ProPay Card Tier","Rent Balance Type","*Rent Amount Type","Rent Schedule Amount Type","Rent ACH","Rent Card","Rent ICL","Rent ACH Flat Fee","Rent Debit Flat Fee","Rent Credit Percentage Fee","Rent Max Amt","Application Bank Account","Application Bank Routing","Application BankServ Client ID","Application BankServ Client Code","Application BankServ ICL Code","Application ProPay Card Tier","Application ACH","Application Card","Application ACH Flat Fee","Application Debit Flat Fee","Application Credit Percentage Fee","Application Max Amt","Deposit Bank Account","Deposit Bank Routing","Deposit BankServ Client ID","Deposit BankServ Client Code","Deposit BankServ ICL Code","Deposit ProPay Card Tier","Deposit ACH","Deposit Card","Deposit ICL","Deposit ACH Flat Fee","Deposit Debit Flat Fee","Deposit Credit Percentage Fee","Deposit Max Amt","Result Limit","Engagement Days","Search Type","Messaging","Payments","Scanning","Maintenance","Surveys"]
[null,null,null,null,null,null,null,null,null,null,null,null,null,null,null,null,null,null,{"$f":"IFERROR(__xludf.DUMMYFUNCTION(\"QUERY('Property Information'!O2:P40)\"),\"\")","v":""},"",null,null,null,null,null,null,null,null,null,null,null,null,null,null,null,{"$f":"IFERROR(__xludf.DUMMYFUNCTION(\"QUERY('Property Information'!Q2:R40)\"),\"\")","v":""},"",null,null,null,null,null,null,null,null,null,null,{"$f":"IFERROR(__xludf.DUMMYFUNCTION(\"QUERY('Property Information'!S2:T40)\"),\"\")","v":""},""]
[{"$f":"IFERROR(__xludf.DUMMYFUNCTION(\"QUERY('Property Information'!A2:N40)\"),\"\")","v":""},"","","","","","","","","","","","","",null,null,null,null,"","",null,null,null,null,null,null,null,null,null,null,null,null,null,null,null,"","",null,null,null,null,null,null,null,null,null,null,"",""]
["","","","","","","","","","","","","","",null,null,null,null,"","",null,null,null,null,null,null,null,null,null,null,null,null,null,null,null,"","",null,null,null,null,null,null,null,null,null,null,"",""]
["","","","","","","","","","","","","","",null,null,null,null,"","",null,null,null,null,null,null,null,null,null,null,null,null,null,null,null,"","",null,null,null,null,null,null,null,null,null,null,"",""]
["","","","","","","","","","","","","","",null,null,null,null,"","",null,null,null,null,null,null,null,null,null,null,null,null,null,null,null,"","",null,null,null,null,null,null,null,null,null,null,"",""]
["","","","","","","","","","","","","","",null,null,null,null,"","",null,null,null,null,null,null,null,null,null,null,null,null,null,null,null,"","",null,null,null,null,null,null,null,null,null,null,"",""]
["","","","","","","","","","","","","","",null,null,null,null,"","",null,null,null,null,null,null,null,null,null,null,null,null,null,null,null,"","",null,null,null,null,null,null,null,null,null,null,"",""]
["","","","","","","","","","","","","","",null,null,null,null,"","",null,null,null,null,null,null,null,null,null,null,null,null,null,null,null,"","",null,null,null,null,null,null,null,null,null,null,"",""]
["","","","","","","","","","","","","","",null,null,null,null,"","",null,null,null,null,null,null,null,null,null,null,null,null,null,null,null,"","",null,null,null,null,null,null,null,null,null,null,"",""]
["","","","","","","","","","","","","","",null,null,null,null,"","",null,null,null,null,null,null,null,null,null,null,null,null,null,null,null,"","",null,null,null,null,null,null,null,null,null,null,"",""]
["","","","","","","","","","","","","","",null,null,null,null,"","",null,null,null,null,null,null,null,null,null,null,null,null,null,null,null,"","",null,null,null,null,null,null,null,null,null,null,"",""]
["","","","","","","","","","","","","","",null,null,null,null,"","",null,null,null,null,null,null,null,null,null,null,null,null,null,null,null,"","",null,null,null,null,null,null,null,null,null,null,"",""]
["","","","","","","","","","","","","","",null,null,null,null,"","",null,null,null,null,null,null,null,null,null,null,null,null,null,null,null,"","",null,null,null,null,null,null,null,null,null,null,"",""]
["","","","","","","","","","","","","","",null,null,null,null,"","",null,null,null,null,null,null,null,null,null,null,null,null,null,null,null,"","",null,null,null,null,null,null,null,null,null,null,"",""]
["","","","","","","","","","","","","","",null,null,null,null,"","",null,null,null,null,null,null,null,null,null,null,null,null,null,null,null,"","",null,null,null,null,null,null,null,null,null,null,"",""]
["","","","","","","","","","","","","","",null,null,null,null,"","",null,null,null,null,null,null,null,null,null,null,null,null,null,null,null,"","",null,null,null,null,null,null,null,null,null,null,"",""]
["","","","","","","","","","","","","","",null,null,null,null,"","",null,null,null,null,null,null,null,null,null,null,null,null,null,null,null,"","",null,null,null,null,null,null,null,null,null,null,"",""]
["","","","","","","","","","","","","","",null,null,null,null,"","",null,null,null,null,null,null,null,null,null,null,null,null,null,null,null,"","",null,null,null,null,null,null,null,null,null,null,"",""]
["","","","","","","","","","","","","","",null,null,null,null,"","",null,null,null,null,null,null,null,null,null,null,null,null,null,null,null,"","",null,null,null,null,null,null,null,null,null,null,"",""]
["","","","","","","","","","","","","","",null,null,null,null,"","",null,null,null,null,null,null,null,null,null,null,null,null,null,null,null,"","",null,null,null,null,null,null,null,null,null,null,"",""]
["","","","","","","","","","","","","","",null,null,null,null,"","",null,null,null,null,null,null,null,null,null,null,null,null,null,null,null,"","",null,null,null,null,null,null,null,null,null,null,"",""]
["","","","","","","","","","","","","","",null,null,null,null,"","",null,null,null,null,null,null,null,null,null,null,null,null,null,null,null,"","",null,null,null,null,null,null,null,null,null,null,"",""]
["","","","","","","","","","","","","","",null,null,null,null,"","",null,null,null,null,null,null,null,null,null,null,null,null,null,null,null,"","",null,null,null,null,null,null,null,null,null,null,"",""]
["","","","","","","","","","","","","","",null,null,null,null,"","",null,null,null,null,null,null,null,null,null,null,null,null,null,null,null,"","",null,null,null,null,null,null,null,null,null,null,"",""]
["","","","","","","","","","","","","","",null,null,null,null,"","",null,null,null,null,null,null,null,null,null,null,null,null,null,null,null,"","",null,null,null,null,null,null,null,null,null,null,"",""]
["","","","","","","","","","","","","","",null,null,null,null,"","",null,null,null,null,null,null,null,null,null,null,null,null,null,null,null,"","",null,null,null,null,null,null,null,null,null,null,"",""]
["","","","","","","","","","","","","","",null,null,null,null,"","",null,null,null,null,null,null,null,null,null,null,null,null,null,null,null,"","",null,null,null,null,null,null,null,null,null,null,"",""]
["","","","","","","","","","","","","","",null,null,null,null,"","",null,null,null,null,null,null,null,null,null,null,null,null,null,null,null,"","",null,null,null,null,null,null,null,null,null,null,"",""]
["","","","","","","","","","","","","","",null,null,null,null,"","",null,null,null,null,null,null,null,null,null,null,null,null,null,null,null,"","",null,null,null,null,null,null,null,null,null,null,"",""]
["","","","","","","","","","","","","","",null,null,null,null,"","",null,null,null,null,null,null,null,null,null,null,null,null,null,null,null,"","",null,null,null,null,null,null,null,null,null,null,"",""]
["","","","","","","","","","","","","","",null,null,null,null,"","",null,null,null,null,null,null,null,null,null,null,null,null,null,null,null,"","",null,null,null,null,null,null,null,null,null,null,"",""]
["","","","","","","","","","","","","","",null,null,null,null,"","",null,null,null,null,null,null,null,null,null,null,null,null,null,null,null,"","",null,null,null,null,null,null,null,null,null,null,"",""]
["","","","","","","","","","","","","","",null,null,null,null,"","",null,null,null,null,null,null,null,null,null,null,null,null,null,null,null,"","",null,null,null,null,null,null,null,null,null,null,"",""]
["","","","","","","","","","","","","","",null,null,null,null,"","",null,null,null,null,null,null,null,null,null,null,null,null,null,null,null,"","",null,null,null,null,null,null,null,null,null,null,"",""]
["","","","","","","","","","","","","","",null,null,null,null,"","",null,null,null,null,null,null,null,null,null,null,null,null,null,null,null,"","",null,null,null,null,null,null,null,null,null,null,"",""]
["","","","","","","","","","","","","","",null,null,null,null,"","",null,null,null,null,null,null,null,null,null,null,null,null,null,null,null,"","",null,null,null,null,null,null,null,null,null,null,"",""]
["","","","","","","","","","","","","","",null,null,null,null,"","",null,null,null,null,null,null,null,null,null,null,null,null,null,null,null,"","",null,null,null,null,null,null,null,null,null,null,"",""]
["","","","","","","","","","","","","","",null,null,null,null,"","",null,null,null,null,null,null,null,null,null,null,null,null,null,null,null,"","",null,null,null,null,null,null,null,null,null,null,"",""]
["","","","","","","","","","","","","","",null,null,null,null,"","",null,null,null,null,null,null,null,null,null,null,null,null,null,null,null,"","",null,null,null,null,null,null,null,null,null,null,"",""]
["","","","","","","","","","","","","",""]